Home > Zip File > Maven Build Failure Cannot Read Zip File Entry

Maven Build Failure Cannot Read Zip File Entry

Contents

How often should I replace windscreen wiper blades? Zener diodes in glass axial package - not inherently shielded from photoelectric effect? Why is the 'You talking to me' speech from the movie 'Taxi Driver' so famous? C++ calculator using classes My cat sat on my laptop, now the right side of my keyboard types the wrong characters Start a coup online without the government intervening What is have a peek at this web-site

share|improve this answer answered May 19 '14 at 6:51 user3413464 211 add a comment| up vote 1 down vote This error can occur when your connection gets interrupted during your dependencies GO OUT AND VOTE Drawing a torso with a head (using \draw) Where to take phone interview while at work Can a text in Latin be understood by an educated Italian I've been trying to download those jars ever since and maven and eclipse helios have driven me total nuts. Duplicate : stackoverflow.com/questions/10083482/… –Hardik Mishra Apr 10 '12 at 7:57 add a comment| 4 Answers 4 active oldest votes up vote 7 down vote accepted Try to open the jar with http://stackoverflow.com/questions/10085045/maven-build-failure-cannot-read-zip-file-entry

Error In Opening Zip File During Maven Build

How often should I replace windscreen wiper blades? posted 6 years ago Why is it not downloading automatically? Build failure. 0 Maven tries to download older version of maven-clean-plugin and gives 'failed to parse plugin descriptor' error 5 Scala SBT / Maven2 Error on OSX: “Error Opening Zip File” Not behind a proxy.

My cat sat on my laptop, now the right side of my keyboard types the wrong characters What is the point of update independent rendering in a game loop? The solution is: According to error information being given, to find the corresponding jar in maven repository and deleted. It has been working for many months, but when setting up a new machine, I am unable to compile, with error accessing a dependency file. [ant:javac] error: error reading /Users/rayj/.gradle/caches/artifacts-4/com.google.guava/guava/c12498cf18507aa6433a94eb7d3e77d5/jars/guava-11.0.2.jar; cannot Ant Error In Opening Zip File Is there a word for being sad about knowing that the things that make you happy will eventually go away Teenage daughter refusing to go to school How do pilots identify

I can manually workaround this issue by: for each corrupt jar file - rename to .zip and extract to create a new jar (this turns a corrupt jar into a non-corrupt If a wondrous item was dynamically created as slimy, can I remove the smell with prestidigitation? Are you behind a firewall or proxy ? 3. In settings.xml specify the localRepository path explicitly.

Are you behind a firewall or proxy ? 3. Maven-clean-plugin-2.4.1.jar) Error In Opening Zip File It is the only version that even lets me run Maven Install successfully. Build me a brick wall! current community chat Stack Overflow Meta Stack Overflow your communities Sign up or log in to customize your list.

Error In Opening Zip File Java

Please type your message and try again. 1 Reply Latest reply on Nov 21, 2011 9:19 AM by jaikiran pai jboss-as build failure on mac with jsf-impl-2.1.3-b02-jbossorg-2.jar; cannot read zip file http://forum.broadleafcommerce.org/viewtopic.php?t=1626 Kashif Mughal Ranch Hand Posts: 44 posted 6 years ago Hi I have just removed the dependency and did the maven:clean and maven:install using the m2eclipse, I am getting the following Error In Opening Zip File During Maven Build It's a core plugin.... Error In Opening Zip File Jenkins If it fails, delete the file from your local repository, and retry to run your app.

Again, it required manually getting the file myself. more stack exchange communities company blog Stack Exchange Inbox Reputation and Badges sign up log in tour help Tour Start here for a quick overview of the site Help Center Detailed How do I resolve this? Downloading: http://repo1.maven.org/maven2/org/apache/maven/plugins/maven-surefire-plugin/2.7.1/maven-surefire-plugin-2.7.1.pom Downloaded: http://repo1.maven.org/maven2/org/apache/maven/plugins/maven-surefire-plugin/2.7.1/maven-surefire-plugin-2.7.1.pom (10 KB at 28.9 KB/sec) Downloading: http://repo1.maven.org/maven2/org/apache/maven/surefire/surefire/2.7.1/surefire-2.7.1.pom Downloaded: http://repo1.maven.org/maven2/org/apache/maven/surefire/surefire/2.7.1/surefire-2.7.1.pom (10 KB at 40.7 KB/sec) Downloading: http://repo1.maven.org/maven2/org/apache/maven/maven-parent/18/maven-parent-18.pom Downloaded: http://repo1.maven.org/maven2/org/apache/maven/maven-parent/18/maven-parent-18.pom (24 KB at 74.0 KB/sec) Downloading: http://repo1.maven.org/maven2/org/apache/apache/8/apache-8.pom Downloaded: http://repo1.maven.org/maven2/org/apache/apache/8/apache-8.pom Error In Opening Zip File Android Studio

I was able to determine that the "corrupted" jar file(s) had a behavior different than "non-corrupted" jar files. Join them; it only takes a minute: Sign up maven build failure: cannot read zip file entry up vote -1 down vote favorite i am getting this exception when try to Old Forum jasonray (jasonray) 2012-07-03 15:54:00 UTC #1 I have a project that compiles using gradle with dependencies in a maven repo. http://usableflash.com/zip-file/maven-assembly-plugin-a-zip-file-cannot-include-itself.php Post Reply Bookmark Topic Watch Topic New Topic programming forums Java Java JSRs Mobile Certification Databases Caching Books Engineering Languages Frameworks Products This Site Careers Other all forums Forum: Ant, Maven

Close All Maven projects start with failure - cannot open zip file Genuitec :: Driving Development for Leading Organizations › Forums › MyEclipse IDE › Maven for MyEclipse (Maven4MyEclipse) Tagged:In breathing, Error In Opening Zip File Eclipse Changing maven compiler plugin version to 3.1 helped. org.apache.maven.plugins maven-compiler-plugin 3.1 1.8 1.8 share|improve this answer answered Jul 1 at 5:44 Puneet Jaiswal 10637 add a comment| Only firewall is the one that comes with Windows 7. 3.

Should you change a thermostat when changing your water pump Are there still systems around with a /bin/sh binary?

Edit: I may have spoken too soon, now I am getting that first error again (and it's Maven 3.0.5) Description Resource Path Location Type Cannot read lifecycle mapping metadata for artifact Why do languages require parenthesis around expressions when used with "if" and "while"? This tool uses JavaScript and much of it will not work correctly without it enabled. Javac Error In Opening Zip File The build fails on the Web Subsystem with several "cannot find symbol" messages preceeeded by failing to read the zip.[ERROR] error: error reading /Users/[user]/.m2/repository/com/sun/faces/jsf-impl/2.1.3-b02-jbossorg-2/jsf-impl-2.1.3-b02-jbossorg-2.jar; cannot read zip file entry[ERROR] /Users/[user]/dev/jboss-as/web/src/main/java/org/jboss/as/web/deployment/jsf/JsfInjectionProvider.java:[24,24] package

Good new ending to story, I realized that I was on an older version of gradle (1.6 milestone) - and this problem was resolved by upgrading to the release version (1.0). For "non-corrupted" jar files, I can rename to ".zip" and extract the zip to see the contents of the file (as expected). more hot questions question feed lang-xml about us tour help blog chat data legal privacy policy work here advertising info mobile contact us feedback Technology Life / Arts Culture / Recreation A story behind a weird inductor Start a coup online without the government intervening What is a Rotary Club Word™?

more stack exchange communities company blog Stack Exchange Inbox Reputation and Badges sign up log in tour help Tour Start here for a quick overview of the site Help Center Detailed share|improve this answer answered May 21 '12 at 19:47 David Gorsline 4,05582131 Simpler is to delete the folder in the local repository and just retry the build. Regards, K Mughal. Thanks. –skip May 22 '12 at 21:08 add a comment| Your Answer draft saved draft discarded Sign up or log in Sign up using Google Sign up using Facebook Sign

share|improve this answer answered Mar 7 '13 at 15:17 John Niedzwiecki 1945 add a comment| up vote 3 down vote go to the .m2/repository and delete the conflicting files mvn -U maven share|improve this question edited May 3 at 11:30 R O M A N I A 13.4k117083 asked Sep 29 '11 at 15:53 UnKnown 5,60447148247 try: mvn -U clean Martijn Verburg author Bartender Posts: 3275 5 I like... Why is Professor Lewin correct regarding dimensional analysis, and I'm not?

That jar was corrupt. Why is this not selected as the correct answer? –Swapnil Nov 6 '12 at 16:48 2 Oh really! Can anyone help me to clarify with the error i get?"[DEBUG] /Project Development/eclipse-workspace/DemoSite/admin/src/main/java[INFO] Compiling 1 source file to /Project Development/eclipse-workspace/DemoSite/admin/target/admin/WEB-INF/classes[INFO] ------------------------------------------------------------------------[INFO] BUILD FAILURE[INFO] ------------------------------------------------------------------------[INFO] Total time: 5.683s[INFO] Finished at: Wed Feb java.runtime.name=Java(TM) SE Runtime Environment java.runtime.version=1.7.0_45-b18 java.specification.name=Java Platform API Specification java.specification.vendor=Oracle Corporation java.specification.version=1.7 java.vendor=Oracle Corporation java.vendor.url=http://java.oracle.com/ java.vendor.url.bug=http://bugreport.sun.com/bugreport/ java.version=1.7.0_45 java.vm.info=mixed mode java.vm.name=Java HotSpot(TM) 64-Bit Server VM java.vm.specification.name=Java Virtual Machine Specification java.vm.specification.vendor=Oracle Corporation java.vm.specification.version=1.7

A required class is missing: org/apache/maven/shared/filtering/MavenFilteringException ----------------------------------------------------- realm = plugin>org.apache.maven.plugins:maven-resources-plugin:2.4.1 strategy = org.codehaus.plexus.classworlds.strategy.SelfFirstStrategy urls[0] = file:/C:/Documents%20and%20Settings/Kashif%20Mughal/.m2/repository/org/apache/maven/plugins/maven-resources-plugin/2.4.1/maven-resources-plugin-2.4.1.jar urls[1] = file:/C:/Documents%20and%20Settings/Kashif%20Mughal/.m2/repository/org/codehaus/plexus/plexus-utils/1.1/plexus-utils-1.1.jar Number of foreign imports: 4 import: Entry[import org.codehaus.plexus.util.xml.pull.XmlSerializer from realm ClassRealm[plexus.core, parent: A failed build often appends to the jar, but doesn't delete it, therefore producing an unreadable file. March 5, 2014 at 12:51 pm #347780 Reply trantParticipant @support-swapna wrote: Trant, Thank you for the log file. 1. Hot Network Questions Polyglot Anagrams Robbers' Thread Does the electoral vote count ever get reallocated between states?

share|improve this answer answered May 21 '12 at 19:45 khmarbaise 46.9k774109 add a comment| up vote 1 down vote It looks like your local repository entry for spring-beans is corrupt in Lab colleague uses cracked software. Browse other questions tagged eclipse spring maven or ask your own question. asked 4 years ago viewed 6518 times active 1 year ago Upcoming Events 2016 Community Moderator Election ends Nov 22 Get the weekly newsletter!